c – 在优胜美地编译咖啡

前端之家收集整理的这篇文章主要介绍了c – 在优胜美地编译咖啡前端之家小编觉得挺不错的,现在分享给大家,也给大家做个参考。
我试图在优胜美地安装咖啡,而我的C不是最强的.这是我的错误
  1. Alis-MacBook-Pro:caffe ali$make all
  2. NVCC src/caffe/layers/absval_layer.cu
  3. /usr/local/include/boost/smart_ptr/detail/sp_counted_base_clang.hpp(27): error: expected a ";"
  4.  
  5. /usr/local/include/boost/smart_ptr/detail/sp_counted_base_clang.hpp(29): error: inline specifier allowed on function declarations only
  6.  
  7. /usr/local/include/boost/smart_ptr/detail/sp_counted_base_clang.hpp(29): error: incomplete type is not allowed
  8.  
  9. /usr/local/include/boost/smart_ptr/detail/sp_counted_base_clang.hpp(29): error: identifier "atomic_int_least32_t" is undefined
  10.  
  11. /usr/local/include/boost/smart_ptr/detail/sp_counted_base_clang.hpp(29): error: identifier "pw" is undefined
  12.  
  13. /usr/local/include/boost/smart_ptr/detail/sp_counted_base_clang.hpp(30): error: expected a ";"
  14.  
  15. /usr/local/include/boost/smart_ptr/detail/sp_counted_base_clang.hpp(90): error: invalid specifier outside a class declaration
  16.  
  17. /usr/local/include/boost/smart_ptr/detail/sp_counted_base_clang.hpp(92): error: "this" may only be used inside a nonstatic member function
  18.  
  19. /usr/local/include/boost/smart_ptr/detail/sp_counted_base_clang.hpp(95): error: invalid specifier outside a class declaration
  20.  
  21. /usr/local/include/boost/smart_ptr/detail/sp_counted_base_clang.hpp(95): error: function "boost::detail::get_deleter" may not be initialized
  22.  
  23. /usr/local/include/boost/smart_ptr/detail/sp_counted_base_clang.hpp(96): error: invalid specifier outside a class declaration
  24.  
  25. /usr/local/include/boost/smart_ptr/detail/sp_counted_base_clang.hpp(96): error: function "boost::detail::get_untyped_deleter" may not be initialized
  26.  
  27. /usr/local/include/boost/smart_ptr/detail/sp_counted_base_clang.hpp(100): error: identifier "use_count_" is undefined
  28.  
  29. /usr/local/include/boost/smart_ptr/detail/sp_counted_base_clang.hpp(105): error: identifier "use_count_" is undefined
  30.  
  31. /usr/local/include/boost/smart_ptr/detail/sp_counted_base_clang.hpp(105): error: identifier "atomic_conditional_increment" is undefined
  32.  
  33. /usr/local/include/boost/smart_ptr/detail/sp_counted_base_clang.hpp(110): error: identifier "use_count_" is undefined
  34.  
  35. /usr/local/include/boost/smart_ptr/detail/sp_counted_base_clang.hpp(110): error: identifier "atomic_decrement" is undefined
  36.  
  37. /usr/local/include/boost/smart_ptr/detail/sp_counted_base_clang.hpp(112): error: identifier "dispose" is undefined
  38.  
  39. /usr/local/include/boost/smart_ptr/detail/sp_counted_base_clang.hpp(113): error: identifier "weak_release" is undefined
  40.  
  41. /usr/local/include/boost/smart_ptr/detail/sp_counted_base_clang.hpp(119): error: identifier "weak_count_" is undefined
  42.  
  43. /usr/local/include/boost/smart_ptr/detail/sp_counted_base_clang.hpp(124): error: identifier "weak_count_" is undefined
  44.  
  45. /usr/local/include/boost/smart_ptr/detail/sp_counted_base_clang.hpp(124): error: identifier "atomic_decrement" is undefined
  46.  
  47. /usr/local/include/boost/smart_ptr/detail/sp_counted_base_clang.hpp(130): error: a type qualifier is not allowed on a nonmember function
  48.  
  49. /usr/local/include/boost/smart_ptr/detail/sp_counted_base_clang.hpp(132): error: "atomic_int_least32_t" is not a type name
  50.  
  51. /usr/local/include/boost/smart_ptr/detail/sp_counted_base_clang.hpp(132): error: identifier "use_count_" is undefined
  52.  
  53. /usr/local/include/boost/smart_ptr/detail/sp_counted_base_clang.hpp(132): error: the first argument of this c11 atomic builtin must be a pointer to the _Atomic type
  54.  
  55. /usr/local/include/boost/smart_ptr/detail/sp_counted_base_clang.hpp(132): error: expected a ";"
  56.  
  57. /usr/local/include/boost/smart_ptr/detail/sp_counted_base_clang.hpp(138): error: expected a declaration
  58.  
  59. /usr/local/include/boost/smart_ptr/detail/sp_counted_impl.hpp(127): error: not a class or struct name
  60.  
  61. /usr/local/include/boost/smart_ptr/detail/sp_counted_impl.hpp(156): error: identifier "sp_typeinfo" is undefined
  62.  
  63. /usr/local/include/boost/smart_ptr/detail/sp_counted_impl.hpp(195): error: not a class or struct name
  64.  
  65. /usr/local/include/boost/smart_ptr/detail/sp_counted_impl.hpp(252): error: identifier "sp_typeinfo" is undefined
  66.  
  67. /usr/local/include/boost/smart_ptr/detail/sp_counted_impl.hpp(267): error: expected a declaration
  68.  
  69. /Applications/Xcode.app/Contents/Developer/Toolchains/XcodeDefault.xctoolchain/usr/bin/../include/c++/v1/functional(543): error: binary_function is not a template
  70.  
  71. /Applications/Xcode.app/Contents/Developer/Toolchains/XcodeDefault.xctoolchain/usr/bin/../include/c++/v1/functional(543): error: not a class or struct name
  72.  
  73. /Applications/Xcode.app/Contents/Developer/Toolchains/XcodeDefault.xctoolchain/usr/bin/../include/c++/v1/functional(568): error: binary_function is not a template
  74.  
  75. /Applications/Xcode.app/Contents/Developer/Toolchains/XcodeDefault.xctoolchain/usr/bin/../include/c++/v1/functional(568): error: not a class or struct name
  76.  
  77. /Applications/Xcode.app/Contents/Developer/Toolchains/XcodeDefault.xctoolchain/usr/bin/../include/c++/v1/functional(593): error: binary_function is not a template
  78.  
  79. /Applications/Xcode.app/Contents/Developer/Toolchains/XcodeDefault.xctoolchain/usr/bin/../include/c++/v1/functional(593): error: not a class or struct name
  80.  
  81. /Applications/Xcode.app/Contents/Developer/Toolchains/XcodeDefault.xctoolchain/usr/bin/../include/c++/v1/functional(618): error: unary_function is not a template
  82.  
  83. /Applications/Xcode.app/Contents/Developer/Toolchains/XcodeDefault.xctoolchain/usr/bin/../include/c++/v1/functional(618): error: not a class or struct name
  84.  
  85. /Applications/Xcode.app/Contents/Developer/Toolchains/XcodeDefault.xctoolchain/usr/bin/../include/c++/v1/functional(643): error: binary_function is not a template
  86.  
  87. /Applications/Xcode.app/Contents/Developer/Toolchains/XcodeDefault.xctoolchain/usr/bin/../include/c++/v1/functional(643): error: not a class or struct name
  88.  
  89. /Applications/Xcode.app/Contents/Developer/Toolchains/XcodeDefault.xctoolchain/usr/bin/../include/c++/v1/functional(668): error: binary_function is not a template
  90.  
  91. /Applications/Xcode.app/Contents/Developer/Toolchains/XcodeDefault.xctoolchain/usr/bin/../include/c++/v1/functional(668): error: not a class or struct name
  92.  
  93. /Applications/Xcode.app/Contents/Developer/Toolchains/XcodeDefault.xctoolchain/usr/bin/../include/c++/v1/functional(693): error: binary_function is not a template
  94.  
  95. /Applications/Xcode.app/Contents/Developer/Toolchains/XcodeDefault.xctoolchain/usr/bin/../include/c++/v1/functional(693): error: not a class or struct name
  96.  
  97. /Applications/Xcode.app/Contents/Developer/Toolchains/XcodeDefault.xctoolchain/usr/bin/../include/c++/v1/functional(720): error: binary_function is not a template
  98.  
  99. /Applications/Xcode.app/Contents/Developer/Toolchains/XcodeDefault.xctoolchain/usr/bin/../include/c++/v1/functional(720): error: not a class or struct name
  100.  
  101. /Applications/Xcode.app/Contents/Developer/Toolchains/XcodeDefault.xctoolchain/usr/bin/../include/c++/v1/functional(745): error: binary_function is not a template
  102.  
  103. /Applications/Xcode.app/Contents/Developer/Toolchains/XcodeDefault.xctoolchain/usr/bin/../include/c++/v1/functional(745): error: not a class or struct name
  104.  
  105. /Applications/Xcode.app/Contents/Developer/Toolchains/XcodeDefault.xctoolchain/usr/bin/../include/c++/v1/functional(770): error: binary_function is not a template
  106.  
  107. /Applications/Xcode.app/Contents/Developer/Toolchains/XcodeDefault.xctoolchain/usr/bin/../include/c++/v1/functional(770): error: not a class or struct name
  108.  
  109. /Applications/Xcode.app/Contents/Developer/Toolchains/XcodeDefault.xctoolchain/usr/bin/../include/c++/v1/functional(795): error: binary_function is not a template
  110.  
  111. /Applications/Xcode.app/Contents/Developer/Toolchains/XcodeDefault.xctoolchain/usr/bin/../include/c++/v1/functional(795): error: not a class or struct name
  112.  
  113. /Applications/Xcode.app/Contents/Developer/Toolchains/XcodeDefault.xctoolchain/usr/bin/../include/c++/v1/functional(820): error: unary_function is not a template
  114.  
  115. /Applications/Xcode.app/Contents/Developer/Toolchains/XcodeDefault.xctoolchain/usr/bin/../include/c++/v1/functional(820): error: not a class or struct name
  116.  
  117. /Applications/Xcode.app/Contents/Developer/Toolchains/XcodeDefault.xctoolchain/usr/bin/../include/c++/v1/functional(845): error: binary_function is not a template
  118.  
  119. /Applications/Xcode.app/Contents/Developer/Toolchains/XcodeDefault.xctoolchain/usr/bin/../include/c++/v1/functional(845): error: not a class or struct name
  120.  
  121. /Applications/Xcode.app/Contents/Developer/Toolchains/XcodeDefault.xctoolchain/usr/bin/../include/c++/v1/functional(870): error: binary_function is not a template
  122.  
  123. /Applications/Xcode.app/Contents/Developer/Toolchains/XcodeDefault.xctoolchain/usr/bin/../include/c++/v1/functional(870): error: not a class or struct name
  124.  
  125. /Applications/Xcode.app/Contents/Developer/Toolchains/XcodeDefault.xctoolchain/usr/bin/../include/c++/v1/functional(895): error: binary_function is not a template
  126.  
  127. /Applications/Xcode.app/Contents/Developer/Toolchains/XcodeDefault.xctoolchain/usr/bin/../include/c++/v1/functional(895): error: not a class or struct name
  128.  
  129. /Applications/Xcode.app/Contents/Developer/Toolchains/XcodeDefault.xctoolchain/usr/bin/../include/c++/v1/functional(937): error: unary_function is not a template
  130.  
  131. /Applications/Xcode.app/Contents/Developer/Toolchains/XcodeDefault.xctoolchain/usr/bin/../include/c++/v1/functional(937): error: not a class or struct name
  132.  
  133. /Applications/Xcode.app/Contents/Developer/Toolchains/XcodeDefault.xctoolchain/usr/bin/../include/c++/v1/functional(956): error: binary_function is not a template
  134.  
  135. /Applications/Xcode.app/Contents/Developer/Toolchains/XcodeDefault.xctoolchain/usr/bin/../include/c++/v1/functional(956): error: not a class or struct name
  136.  
  137. /Applications/Xcode.app/Contents/Developer/Toolchains/XcodeDefault.xctoolchain/usr/bin/../include/c++/v1/functional(978): error: unary_function is not a template
  138.  
  139. /Applications/Xcode.app/Contents/Developer/Toolchains/XcodeDefault.xctoolchain/usr/bin/../include/c++/v1/functional(978): error: not a class or struct name
  140.  
  141. /Applications/Xcode.app/Contents/Developer/Toolchains/XcodeDefault.xctoolchain/usr/bin/../include/c++/v1/functional(1004): error: unary_function is not a template
  142.  
  143. /Applications/Xcode.app/Contents/Developer/Toolchains/XcodeDefault.xctoolchain/usr/bin/../include/c++/v1/functional(1004): error: not a class or struct name
  144.  
  145. /Applications/Xcode.app/Contents/Developer/Toolchains/XcodeDefault.xctoolchain/usr/bin/../include/c++/v1/functional(1030): error: unary_function is not a template
  146.  
  147. /Applications/Xcode.app/Contents/Developer/Toolchains/XcodeDefault.xctoolchain/usr/bin/../include/c++/v1/functional(1030): error: not a class or struct name
  148.  
  149. /Applications/Xcode.app/Contents/Developer/Toolchains/XcodeDefault.xctoolchain/usr/bin/../include/c++/v1/functional(1048): error: binary_function is not a template
  150.  
  151. /Applications/Xcode.app/Contents/Developer/Toolchains/XcodeDefault.xctoolchain/usr/bin/../include/c++/v1/functional(1048): error: not a class or struct name
  152.  
  153. /Applications/Xcode.app/Contents/Developer/Toolchains/XcodeDefault.xctoolchain/usr/bin/../include/c++/v1/functional(1065): error: unary_function is not a template
  154.  
  155. /Applications/Xcode.app/Contents/Developer/Toolchains/XcodeDefault.xctoolchain/usr/bin/../include/c++/v1/functional(1065): error: not a class or struct name
  156.  
  157. /Applications/Xcode.app/Contents/Developer/Toolchains/XcodeDefault.xctoolchain/usr/bin/../include/c++/v1/functional(1076): error: binary_function is not a template
  158.  
  159. /Applications/Xcode.app/Contents/Developer/Toolchains/XcodeDefault.xctoolchain/usr/bin/../include/c++/v1/functional(1076): error: not a class or struct name
  160.  
  161. /Applications/Xcode.app/Contents/Developer/Toolchains/XcodeDefault.xctoolchain/usr/bin/../include/c++/v1/functional(1099): error: unary_function is not a template
  162.  
  163. /Applications/Xcode.app/Contents/Developer/Toolchains/XcodeDefault.xctoolchain/usr/bin/../include/c++/v1/functional(1099): error: not a class or struct name
  164.  
  165. /Applications/Xcode.app/Contents/Developer/Toolchains/XcodeDefault.xctoolchain/usr/bin/../include/c++/v1/functional(1110): error: binary_function is not a template
  166.  
  167. /Applications/Xcode.app/Contents/Developer/Toolchains/XcodeDefault.xctoolchain/usr/bin/../include/c++/v1/functional(1110): error: not a class or struct name
  168.  
  169. /Applications/Xcode.app/Contents/Developer/Toolchains/XcodeDefault.xctoolchain/usr/bin/../include/c++/v1/functional(1133): error: unary_function is not a template
  170.  
  171. /Applications/Xcode.app/Contents/Developer/Toolchains/XcodeDefault.xctoolchain/usr/bin/../include/c++/v1/functional(1133): error: not a class or struct name
  172.  
  173. /Applications/Xcode.app/Contents/Developer/Toolchains/XcodeDefault.xctoolchain/usr/bin/../include/c++/v1/functional(1144): error: binary_function is not a template
  174.  
  175. /Applications/Xcode.app/Contents/Developer/Toolchains/XcodeDefault.xctoolchain/usr/bin/../include/c++/v1/functional(1144): error: not a class or struct name
  176.  
  177. /Applications/Xcode.app/Contents/Developer/Toolchains/XcodeDefault.xctoolchain/usr/bin/../include/c++/v1/functional(1167): error: unary_function is not a template
  178.  
  179. /Applications/Xcode.app/Contents/Developer/Toolchains/XcodeDefault.xctoolchain/usr/bin/../include/c++/v1/functional(1167): error: not a class or struct name
  180.  
  181. /Applications/Xcode.app/Contents/Developer/Toolchains/XcodeDefault.xctoolchain/usr/bin/../include/c++/v1/functional(1179): error: binary_function is not a template
  182.  
  183. /Applications/Xcode.app/Contents/Developer/Toolchains/XcodeDefault.xctoolchain/usr/bin/../include/c++/v1/functional(1179): error: not a class or struct name
  184.  
  185. /Applications/Xcode.app/Contents/Developer/Toolchains/XcodeDefault.xctoolchain/usr/bin/../include/c++/v1/__functional_03(22): error: __weak_result_type is not a template
  186.  
  187. /Applications/Xcode.app/Contents/Developer/Toolchains/XcodeDefault.xctoolchain/usr/bin/../include/c++/v1/__functional_03(22): error: not a class or struct name
  188.  
  189. /Applications/Xcode.app/Contents/Developer/Toolchains/XcodeDefault.xctoolchain/usr/bin/../include/c++/v1/__functional_03(35): error: __invoke_return is not a template
  190.  
  191. /Applications/Xcode.app/Contents/Developer/Toolchains/XcodeDefault.xctoolchain/usr/bin/../include/c++/v1/__functional_03(42): error: __invoke_return0 is not a template
  192.  
  193. /Applications/Xcode.app/Contents/Developer/Toolchains/XcodeDefault.xctoolchain/usr/bin/../include/c++/v1/__functional_03(49): error: __invoke_return1 is not a template
  194.  
  195. /Applications/Xcode.app/Contents/Developer/Toolchains/XcodeDefault.xctoolchain/usr/bin/../include/c++/v1/__functional_03(56): error: __invoke_return2 is not a template
  196.  
  197. /Applications/Xcode.app/Contents/Developer/Toolchains/XcodeDefault.xctoolchain/usr/bin/../include/c++/v1/__functional_03(202): error: not a class or struct name
  198.  
  199. /Applications/Xcode.app/Contents/Developer/Toolchains/XcodeDefault.xctoolchain/usr/bin/../include/c++/v1/__functional_03(218): error: unary_function is not a template
  200.  
  201. /Applications/Xcode.app/Contents/Developer/Toolchains/XcodeDefault.xctoolchain/usr/bin/../include/c++/v1/__functional_03(218): error: not a class or struct name
  202.  
  203. Error limit reached.
  204. 100 errors detected in the compilation of "/var/folders/6q/pzmrbk9d2_j0307lfmgbtf4r0000gn/T//tmpxft_00007c25_00000000-16_absval_layer.compute_50.cpp1.ii".
  205. Compilation terminated.
  206. make: *** [.build_release/cuda/src/caffe/layers/absval_layer.o] Error 1

我猜这个问题是编译器,所以我从brew安装了gcc并尝试运行它

  1. make all CC=/usr/local/bin/gcc-5.2

这仍然没有帮助.

有什么建议么?

解决方法

猜你在找的C&C++相关文章